Win32 193





" You will also find that C:\Program Files\Symantec\DLO \XPDLOShareu. Used P/Invoke method to use · Any CPU will give you a 64 bit process on win64, you. When you wrote that it worked on one of the systems, we thought that the problem was related to the specific server configuration. Win32 App Installation Failure In the video downloaded and extracted Microsoft Mathematics then packaged it up as a Win32 Intune app. Any help on this would be greatly appreciated. Battlefield returns on October 22, 2021. Vinyl emulator. Installation & Troubleshooting. exe" By the way, I already install TexLive but do not know how to start it. Reported component name. Unzip the zip file, and copy releaseWindowssnap7. I never said you couldn't. Drop Files. 63: Chrome is a web browser developed by Google. you may have a 32 bit version of tensorflow?. IOException: Cannot run program "E:\Program Files\arduino-1. 192 (0xC0) The operating system cannot run %1. Learn more about the World of 2042 with our Narrative team at DICE, and familiarize yourself with one of our new Specialists - a returning fan favorite. Última Versión. JonMaguire. dll, or one of the DLLs it references. If the problems started after that, it may work. The first item is the name of the exported function as string, or the ordinal of the exported function as small integer. pandas 問題が解決しない場合は 再インストールし てください. I stumbled over some fairly obvious things when importing a Windows dll in python this morning. I recently upgraded from Max 2013 to 2014. PARAMETER DisplayName. When building NSIS on Windows, zlib1. dll is 2,138 KB. Files (0) Post. OS: Windows 10, openSuse 42. There're two solutions: Replace 32bit dll with 64bit one, if you can get one. Welcome To The Channel YES CHAMPHow To Fix ( Error 193: %1 Is Not A Valid Win32 Application. You may opt to simply delete the quarantined files. exe) tries to start the Server service, the program verifies the following paths:. Part 3, Deep dive Microsoft Intune Management Extension - Win32 Apps. I have now fixed this issue. Learn more. Windows storage Disks, partitions and volumes have the following relation: Let's focus on every one of them on the following sections. Then click on the Next Button. I tried it too and your right. If you browse to C:\Windows\system32\powershell. Is there any possibility to roll out project and visio separatly? (also where visio and project land on the same device). 21 For 3ds Max [WIN32 WIN64] aileeirw. Problem: I am a beginner to java, swing, netbeans and promise. Win32 App Installation Failure In the video downloaded and extracted Microsoft Mathematics then packaged it up as a Win32 Intune app. Bicep version bicep --version Bicep CLI version 0. zip and used the PHP 5. buildServer. I debugged a bit and found that ntdll!LdrpMapImage, after returning from LdrpMapViewOfSection, check for the IMAGE_FILE_DLL flag, and only if that's the module type it even tries to check whether the NTSTATUS returned from LdrpMapViewOfSection was STATUS. A forum community dedicated to tech experts and enthusiasts. Dec 17, 2004 · Thanks, that helps. If you are interested in this topic, please fill a short survey. zip 6/29/2021 4:38 PM 24080315 php-8. For ERROR_BAD_EXE_FORMAT (193), we could also change `strerror` to something like "Invalid executable format" instead of "%1 is not a valid Win32 application". I'm trying to install an application based on if the machine is joined to a domain or a workgroup. OSError: [WinError 193] %1 is not a valid Win32 application The error message is because you mixing are 32-bit and 64-bit. frontend: Failed to run task: 'npm inst. 1 POWER and IR DROP Analysis Apache PowerArtist 2015 PTC. 4 and GEOS (via OSGeo4W ) Then I installed postGIS via Stack App Builder (I have tried both versions - x32 and x64). zip 6/29/2021 4:38 PM 24080315 php-8. dll c:\Windows\SysWOW64\msvcr100_clr0400. It is characterized by its speed and many innovative features. cpl is a windows system file. 12\arduino-builder": CreateProcess error=193, %1 is not a valid Win32 application I have tried both the zip and installer options, but still get the same. To resolve this error, on the DOS command prompt execute the following: R CMD INSTALL -no-multiarch. 0x000000C0. Createprocess error=193, %1 is not a valid win32 application. 04 ProgeCAD 2016 Professional v16. ERROR_ITERATED_DATA_EXCEEDS_64k. In the Control Panel window, change the view to small. Personal Open source Business Explore Sign up Sign in Pricing Blog Support Search GitHub. Came home and saw that eset had caught Bitttorrent. Encountered the same issue. Cannot run %1 in Win32 mode. 90 12/2/2004 192. dll c:\Windows\SysWOW64\msvcr100. If the detected files have already been cleaned, deleted, or quarantined by your Trend Micro product, no further step is required. 7-Win32-vs16-x86. Mar 27, 2019 · CreateProcess error=193, %1 n’est pas une application Win32 valide - Forum - Windows 10. Oct 30, 2008 · You can also start the service by going to Start, Run and type in net start MSIServer into the Run box. Open the Run window, press Win + R, now type control panel and Hit. comment in 2 hours ago. dll c:\Windows\SysWOW64\msvcr100_clr0400. Alternatively you can copy the file somewhere on your file system and adjust the system PATH. That's because a JAR is not an executable file like. Anyone can help me solving the API 193 error?. The operating system cannot run %1. IOException: Cannot run program "C:\usr\bin\glassfish3\glassfish\bin\asadmin": CreateProcesserror=193, %1 is not a valid Win32 application -> [Help 1]org. Please find below the line of code at which I am facing the Error:. Win32::GuiTest is perl module for automation of operations on Win32 GUI interface. See [CHANGES. InteropServices. 0x000000C0. More information. Createprocess error=193, %1 is not a valid win32 application. CreateProcess error=193, %1 ist keine zulässige CreateProcess error=193, %1 ist keine zulässige Win32. Problem: I am a beginner to java, swing, netbeans and promise. dat and patch. It may be important to note that I am using PHP-5. 我在PyScripter使用liblas很多次都没有问题,现在我可以加载所有的标准模块(如:numpy的,GDAL等),但今晚(我需要完成的分析. The extension that is embedded in the application is home. Hi Brian, Sorry for replying so late. Nov 26, 2019 · OSError: [WinError 193] %1 不是有效的 Win32 应用程序。. exe file produced fails to execute. Follow the %1 is Not a Valid Win32 Application PHP steps to disable the firewall. Choose a web site to get translated content where available and see local events and offers. dll must be available along with the library and header files. FAQ Contact Twitter ©2021 — PLUGINS4FREE. Here's a quick guide on disabling the policy that is triggering the " Shellexecuteex Failed " error: Press Windows key + R to open up a Run dialog box. wsfファイルを実行します。. mingw-w64 threads: posix vs win32; Proper way to use **kwargs in Python; DJango doesn't execute request. If Windows Auth (or some other kinds of auth) is enabled, then the 401 2 5 is the server denying access to the anonymous request. Disk Get-Disk To list all operating system visible disks type: You'll get something like: Note: If you run Get-Disk without Admin rights you will receive the following error: "Access to a CIM resource was…. I'm hoping the situation will improve as Windows 10 matures, but I've seen permissions issues even on clean installs (usually inconsequential to the main operation of the PC, but still these were clean installs). Used P/Invoke method to use · Any CPU will give you a 64 bit process on win64, you. We have seen this file use the following names: 2014_05_rechnungonline_8290155236_sign_deutsche_telekom_ag. Sign up today to receive the latest Battlefield news, videos, offers, and more via email (including other EA news, products. from __future__ import print_function import torch x = torch. 0x000000C3. Win32 VST Developed by. WAIT_HINT : 0x0. WAIT_HINT : 0x0. Resolving The Problem. In our previous publications, we wrote about the botnet architecture, its command and control infrastructure, and monetization methods: Phorpiex Breakdown. Now I am trying to read and write the Extensible Linking Format (ELF). prototype (func_spec[, paramflags]) Returns a foreign function exported by a shared library. exe - 193: %1 is not a valid Win32 application. 129666394-693bde5b-2d22-4871-8e0a-3ec5c26225c2. For optimal experience: Start a new game. 158761 - java. This should reveal where PowerShell exe is located. Linux RPM Source and Binaries. Content of build/win32/dumpenv4python. (And the same applies to any CPython extension. 413 AMD E1-1500 APU with radeon(tm) HD graphics 1. LifecycleExecutionException: Failed to execute goal org. Error 193: %1 is not a valid Win32 application. Homepage Statistics. a(Exception A_0, Boolean A_1) at EO. Install the prerequisite manually from the given location without any command line options. exe - 193: %1 is not a valid Win32 application. To resolve this error, on the DOS command prompt execute the following: R CMD INSTALL -no-multiarch. I found a sample script which does this and I was testing it. I debugged a bit and found that ntdll!LdrpMapImage, after returning from LdrpMapViewOfSection, check for the IMAGE_FILE_DLL flag, and only if that's the module type it even tries to check whether the NTSTATUS returned from LdrpMapViewOfSection was STATUS. Google Chrome 86. Is there any possibility to roll out project and visio separatly? (also where visio and project land on the same device). buildServer. Select a Web Site. Project links. Connect and share knowledge within a single location that is structured and easy to search. (193: %1 is not a valid Win32 application) Maybe you're forgetting to run the script through cscript. 195 (0xC3) The operating system cannot run %1. Drop Files. Filter Feed Refresh this feed. Locate, and then click the following registry entry, where is the name of the service: HKEY_LOCAL_MACHINE\SYSTEM\CurrentControlSet\Services\. これを修正するには、次のことができます. ) In this video I'm going to show you How To Fix ( Error 193:. Learn more. 6 Extensions: azure-firewall 0. method == "post" with… How to save traceback / sys. More specifically, I downloaded php5apache2_4. https://www. 193: % 1 is not a valid Win32 application. Error: ImportError: DLL load failed: %1 is not a valid Win32 application. now im not sure why its happening because this should work for my system, i am running Windows 10 pro version 19042. The malware next communicates with C&C server at IP '193. Few months ago i blogged about How to install SCCM client using win32 apps in Intune for co-management and CMG. Visit Stack Exchange. That one should be pretty evident as soon as you install. Server time: Jul/02/2021 22:53:13 (h3). exe n'est pas une application win32 valide - Forum - Virus / Sécurité. CreateProcess-error-193-1-is-not-a-valid-win32-application. ERROR_ITERATED_DATA_EXCEEDS_64k. Support for XP has been dropped some time ago: https://www. dll is not a valid Win32 application. In the right pane, double-click ImagePath. Dec 27, 2016 · Google Chrome, free download. ERROR_EXE_MARKED_INVALID: 193: 0x000000C1 %1 is not a valid Win32 application. Joined Sep 8, 2005 Messages. 5 Polar Instruments si8000 v10. Anyone can help me solving the API 193 error?. Reported component ID. My biggest problem is I just don't know VB, but I've cobbled together some snippets of scripts. When Steve entered the command line in Intune, he entered msiexec /i "MSMath_x64. 1) The process name is incorrect (the drive, name, extension, etc. Hello! We noticed that while you have a Veritas Account, you aren't yet registered to manage cases and use chat. Fast solution & reliable is the following: 1- Uninstall Both GTA & MTA ( make sure to install any other previous versions of MTA) 2- Install Both GTA & MTA again !. Problem: I am a beginner to java, swing, netbeans and promise. Hey everyone. dll c:\Windows\SysWOW64\msvcp100d. Usually launching the corresponding setups from the 3rdParty install folder on your DVD or extracted setup repair such issues. In the right pane, double-click ImagePath. I have been asked by my mom to update and prepare her laptop for her to do the taxes. Specify the display name for a Win32 application. You can exclude it from detection in case you want to continue using it and don't want to disable PUA detection completely. phpstorm配置了phpunit,运行测试文件,然后报错如下:. If the problems started after that, it may work. Bug 252015 - java. This is an error code that indicates either the file or the program you are attempting to run missing or corrupt. We have written a detailed guide to installing our RPM packages, though these simple commands usually do the. It is characterized by its speed and many innovative features. Mark as New; Follow; Mute; Subscribe to RSS. a(Exception A_0, Boolean A_1) at EO. Pastebin is a website where you can store text online for a set period of time. 通过Java和Selenium启动Internet Explorer时出现" OsProcess checkForError:CreateProcess错误= 193,%1不是有效的Win32应用程序" Pycharm与Electron -Runnerw. vbs 193: C:\Scripts\Test. The main thing I would recommend in this case is to uninstall Lightroom (all versions if you have any other installed as well) and then navigating to the application folder and deleting it. 4 and GEOS (via OSGeo4W ) Then I installed postGIS via Stack App Builder (I have tried both versions - x32 and x64). Find and click on Windows Defender Firewall. Click Start, and then click Run. h _PLATFORMS-Michael. Windows 10 Pro 10586. On Windows, use the Windows Control Panel to uninstall Lr 6. Cannot run %1 in Win32 mode. 3-x64-Setup. Booting the computer into Safe Mode makes sure nothing is running in the background that could be. Apr 09, 2014 · I have now fixed this issue. Open C:\cygwin64\bin on Explorer and double click ash. Dear Pleskians! We are evaluating the support of. The operating system cannot run %1. Just over one year ago, Microsoft- with industry and academic partners- utilized a novel combination of legal and technical actions to take control of the Win32/Waledac botnet as the first action in Project MARS (Microsoft Active Response for Security). dll c:\Windows\SysWOW64\msvcr100d. ERROR_INVALID_MINALLOCSIZE. Recently accessed pages. Since I am new to Apache/PHP (normally running PHP on Windows/IIS Servers) it took a while to understand the configuration. In the developer. XP service pack 2 mode , then go back and try to install it again. Then, see your progress by looking at the Measurements. Choose a web site to get translated content where available and see local events and offers. I have been asked by my mom to update and prepare her laptop for her to do the taxes. Joined Sep 8, 2005 Messages. Replication environment -- Modeler/TA 15. It's at this point that people typically do one of two things: either they give up, or they start debugging the script, trying to figure out why their code isn't valid. To report a bug in NetBeans please follow the project's instructions for reporting issues. Project links. In the Control Panel window, change the view to small. My OS is Windows 10 64 bit and I use Anaconda 3. This edition of the compiler is suitable for the Windows NT Operating System and for Windows 95. Locate, and then click the following registry entry, where is the name of the service: HKEY_LOCAL_MACHINE\SYSTEM\CurrentControlSet\Services\. vbs 193: C:\Scripts\Test. Retrieve all assignments for a Win32 app. 该信息未经授权抓取自百度经验. Date: Fri, 25 Mar 2016 12:59:45 -0400. exe n'est pas une application win32 valide - Forum - Virus / Sécurité. ERROR_EXE_MARKED_INVALID. Creator: WildBill Created: 2013-04-16 Updated: 2018-06-08 WildBill - 2013-04-16 I have tried Dev-Cpp several times (many versions). You need to "wrap" the. However, I cannot seem to write a successful batch command · The complication is that mmc. Re: create processerror=193 %1 is not a valid win32 application. Win 32 application is specifically designed for the 32 bit OS. ERROR (1053) The service did not respond to the start or control request in a timely fashion. This worked for me, at least the flashing of the factory image was successful. 3, freeBSD 11, Raspian "Stretch". "%1 is not a valid Win32 application. It's not detected as malware but as a potentially unwanted application which is optional detection. have bad, stray, or whitespace characters) or. My friend has recently got a message appearing on his AVG Resident Shield every time he turns his router on which. WIN32_EXIT_CODE : 193 (0xc1) SERVICE_EXIT_CODE : 0 (0x0) CHECKPOINT : 0x0. Welcome to EDAboard. How to fix Jupyter Notebook import module (OSError: [WinError 193] %1 is not a valid Win32 application). Anyone can help me solving the API 193 error?. syed vazzz wrote: Error:Cannot run program "C:\Users\x\Desktop\jannotatix. Skip to end of metadata. That's because a JAR is not an executable file like. After the uninstall, trash the entire folder "C:\Program Files\Adobe\Adobe Lightroom\" using the Windows Explorer. 6/2/2021 1:27 AM 24595185 php-8. vbs 193: C:\Scripts\Test. In the right pane, double-click ImagePath. A subscription to make the most of your time. The only programming contests Web 2. 6 Extensions: azure-firewall 0. from ctypes import * lib = CDLL ( 'basicDLL' ) print (lib. This is the readme for the Python for Win32 (pywin32) extensions, which provides access to many of the Windows APIs from Python. Removing PC viruses manually may take hours and may damage your PC in the process. May 2, 2007 #2 appwiz. com is an international Electronics Discussion Forum focused on EDA software, circuits, schematics, books, theory, papers, asic, pld, 8051, DSP, Network, RF, Analog Design, PCB, Service Manuals and a whole lot more!. Locate, and then click the following registry entry, where is the name of the service: 4. 2 kB) File type Wheel Python version cp35. In the Open box, type regedit, and then click OK. plugin:maven-glassfish-plugin:2. That's because a JAR is not an executable file like. RUNAS ERROR: Unable to run - C:\Scripts\Test. EXE file (and other required source files if applicable) to an. Problem: I am a beginner to java, swing, netbeans and promise. MySQL Bugs: #626: %1 not a valid win32 application. When Steve entered the command line in Intune, he entered msiexec /i "MSMath_x64. 193 on November 9, 2020. Send mail to python-win32; Project details. On my setup (Windows Server 2012 R2) importing GDAL in Python in the terminal prints the following: >>> import gdal ERROR 1: Can't load requested DLL: C:\Program Files (x86)\GDAL\gdalplugins\gdal_ BAG. Created by David Liu on Feb 10, 2014; Go to start of metadata. It would be important to see the command itself and the call of it to be sure. Reporter: Steven Casey. 2) The process exists, but is not the one you're trying to run (i. It also said it was installed today, which I clearly didnt do. This Bugzilla instance is a read-only archive of historic NetBeans bug reports. For ERROR_BAD_EXE_FORMAT (193), we could also change `strerror` to something like "Invalid executable format" instead of "%1 is not a valid Win32 application". pl at revision 7a3153f07028f193a83a03aad805e1fd3b075b21 in kaios. SUM,DETECT-SECSTORE-DIRECTORY, CreateProcess error=193, upgrade, JAVA, windows, not a valid Win32 application, KBA , BC-UPG-TLS-TLJ , Upgrade tools for Java , Problem About this page This is a preview of a SAP Knowledge Base Article. I try to develop Hadoop File System 3. The design concept is simple, provide the complex services and configuration for Digial Voice on Amateur radio in a way that makes it easily accessable to anyone just starting out, but make it configurable enough to be interesting for those of us who cant help but tinker. This includes problems running `mach build`, `mach configure`, `mach package`, `mach artifact`, and other mach commands related to building Firefox. Fast solution & reliable is the following: 1- Uninstall Both GTA & MTA ( make sure to install any other previous versions of MTA) 2- Install Both GTA & MTA again !. It create an empty folder which name ends in ". pandas 問題が解決しない場合は 再インストールし てください. If the detected files have already been cleaned, deleted, or quarantined by your Trend Micro product, no further step is required. py License: GNU General Public License v2. Cannot serialize a VSS metadata. have bad, stray, or whitespace characters) or. On Windows, use the Windows Control Panel to uninstall Lr 6. Mark as New; Follow; Mute; Subscribe to RSS. It is very likely that you some how get a corrupted install. I'm trying to install an application based on if the machine is joined to a domain or a workgroup. 193 on November 9, 2020. This tutorial has been designed to resolve the issue when the system says that a particular program is not a valid win32 application. End of Feed. exe”,我收到此错误消息。. a(Exception A_0, Boolean A_1) at EO. Maybe better then to create reate a new project and paste your code in there. py and lets run it. Code is simple, and works on 32 bit systems no. io, or by using our public dataset on Google BigQuery. Some searches pointed me to a 'fix' with the find_library part of the code, that I should replace it with the full path to the. Follow the %1 is Not a Valid Win32 Application PHP steps to disable the firewall. Amazingly true. You can exclude it from detection in case you want to continue using it and don't want to disable PUA detection completely. Mar 27, 2019 · CreateProcess error=193, %1 n’est pas une application Win32 valide - Forum - Windows 10. In the Footsteps of a Sextortion Campaign. More Information. File bugs here for general Firefox build system issues. 解决Python调试OSError: [WinError 193] %1 不是有效的 Win32 应用程序,代码先锋网,一个为软件开发程序员提供代码片段和技术文章. Systems\BCAAA\\bcaaa-130'; status=193:0xc1:%1 is not a valid Win32 application. Level 2 ‎06-04-2020 16:56 PDT. For those asking about the -w flag, you have to edit the flash-all. In the Google Blog you can find this post with the announcement and the reference to the found vulnerabilities. The 64-bit driver is much different and would require a total rewrite. 8-nts-Win32-vs16-x86. ERROR_INVALID_MINALLOCSIZE. Some searches pointed me to a 'fix' with the find_library part of the code, that I should replace it with the full path to the. Java SE 8 windows 10 version 1703 version du système d'exploitation 15063. This is by far the biggest step forward in the Modern Management field. Mar 25, 2012 · when start load lr message win32 api error 193 ("unknown error") when calling :: loadlibrary getcfunction and then could not call c f. msvcrt = cdll. -cp35-abi3-win_amd64. So I got H1Z1 yesterday thinking it would be amazing to make some videos on, but when I went to load it it gave me this error. Google Chrome Portable 93. fat files found at (FC3 install location)\data_win32. js / maven / angularjs. pl at revision 7a3153f07028f193a83a03aad805e1fd3b075b21 in kaios. The message "winzipxxx. On 64-bit Windows, there are two versions of the Microsoft ODBC Administrator tool. xf-adesk20_v2. The first item is the name of the exported function as string, or the ordinal of the exported function as small integer. We have written a detailed guide to installing our RPM packages, though these simple commands usually do the. jar" (in directory "C:\Users\x\Desktop"); createProcess error=193, %1 is not a valid win32 application. 0x000000C0. warpster February 21, 2017, 10:30pm #1. Esteban Feldman CreateProcess error=193, %1 is not a valid Win32 application. Modified: 2 Jul 2003 10:42. zip and used the PHP 5. Welcome to EDAboard. それが行われた後、一連の検証がすでに存在するvbscriptの. More Information. Used P/Invoke method to use · Any CPU will give you a 64 bit process on win64, you. exe file Not a valid Win32 executable Forum: Troubleshooting. It is important to note, however, that there are some differences between DoppelPaymer and BitPaymer. If the Program or Common paths exist as files, the Service Control Manager cannot locate the required folders, you. The EXE is loaded at a different address than it's preferred base without relocations applied. exe - 193: %1 is not a valid Win32 application. 194 (0xC2) The operating system cannot run %1. js / maven / angularjs. e-mail addresses. Then click on the Next Button. %1 は win32 モードで実行できません。 error_exe_marked_invalid: 192: 0x000000c0: このオペレーティング システムでは %1 は実行されません。 error_bad_exe_format: 193: 0x000000c1 %1 は有効な win32 アプリケーションではありません。 error_iterated_data_exceeds_64k: 194: 0x000000c2. zip 6/29/2021 4:38. exe file produced fails to execute. zip 6/29/2021 4:26 PM 24684691 php-8. Desktop version, switch to mobile version. I would love to see more documentation/insight on this. Many popular Linux distributions (Redhat, Mandrake, Suse, etc) use the RPM package management system for quick and easy binary package installation. I found a sample script which does this and I was testing it. dll c:\Windows\SysWOW64\msvcp100d. 589!MESSAGE The workspace exited with unsaved changes in the previous session; refreshing workspace to recover changes. Amazingly true. 193 (0xC1) %1 is not a valid Win32 application. License: Python Software Foundation License (PSF). Discription. Pastebin is a website where you can store text online for a set period of time. have bad, stray, or whitespace characters) or. APAR number. Bitcoin wallet contents. Specify parameter to overwrite existing files already in working directory. func_spec must be a 2-tuple (name_or_ordinal, library). E-bass, acoustic sound, leads, slap and ring tones Uses modulation from the phase distortion oscillator as pick on guitar body. OvMsmAccessManager StartService() failed. 7 is attached here. The operating system. " You will also find that C:\Program Files\Symantec\DLO \XPDLOShareu. exe ? Answer this question. Win32 App Installation Failure In the video downloaded and extracted Microsoft Mathematics then packaged it up as a Win32 Intune app. msvcrt = cdll. The win32 application is specifically programmed for the 32-bit Operating System. The cookie is used to store the user consent for the cookies in the category "Analytics". Unfortunately for me her PC was a bit of a mess operationally wise. Before February this was working using the office deployment tool and a Win32 application but that isn't working anymore. Visit Stack Exchange. The trojan collects the following information: restore. Amazingly true. 48ghz mémoire Ram installée 4Go système d'exploitation 64bits processeur x64. zip and used the PHP 5. 0x000000C4. Cookie Duration Description; cookielawinfo-checbox-analytics: 11 months: This cookie is set by GDPR Cookie Consent plugin. hoddack_rasta Messages postés 5 Date d'inscription jeudi 7 mars 2019 Statut Membre Dernière intervention 27 mars 2019 - 27 mars 2019 à 11:27 ratenpion Messages postés 512 Date d'inscription mercredi 8 octobre 2003. is not a valid Win32 application. have bad, stray, or whitespace characters) or. Python project Interpreter: docker-compose CreateProcess error=193 Follow. We do not receive this error when installing SharePoint 2013 (MSIPCClient is also a prereq for 2013). Stereo processor. iso file you created & select "burn disk image". INTUNEWIN file. This is more consistent with how we append ": {filename}" to the message. NiceHash is the leading hub for mining and trading cryptocurrencies, and the largest hashpower marketplace in the world. Oserror: (winerror 193) %1 is not a valid win32 application pyautoit. Lets look at the python side code: Copy Code. Hi Brian, Sorry for replying so late. Oct 30, 2008 · You can also start the service by going to Start, Run and type in net start MSIServer into the Run box. is not a valid Win32 application. Publicidad. The program still works just fine on all Window OSs from Win 2000->XP->Windows 7. Try scanning the file to verify it is not a virus or infected with a virus. Change the rules of war. CreateProcess. May 2, 2007 #2 appwiz. Retrieve all assignments for a Win32 app. Dear Pleskians! We are evaluating the support of. You can exclude it from detection in case you want to continue using it and don't want to disable PUA detection completely. After that, Windows tries to run what seems to be an executable file, it observes this is not a valid Win32 application due to an incomplete download. You'll have to reduce the size of your arrays. In the Footsteps of a Sextortion Campaign. GAUSS is the product of decades of innovation and enhancement by Aptech Systems, a supportive team of experts dedicated to the success of the worldwide GAUSS user community. The second item is the shared library instance. WindowsError: [Error 193] %1 is not a valid Win32 application, WindowsError: [Error 193] %1 is. Download ActivePerl. Welcome To The Channel YES CHAMPHow To Fix ( Error 193: %1 Is Not A Valid Win32 Application. That's because a JAR is not an executable file like. Aug 14, 2016 · Completely ignored arguments: [--nativeLauncherVersion, 307] [02:14:37] [Client thread/INFO]: Setting user: iShue7u7 [02:14:37] [Client thread/INFO]: (Session ID is. 6 Extensions: azure-firewall 0. The EXE is loaded at a different address than it's preferred base without relocations applied. Oct 10, 2019 · 打开软件提示不是有效的win32应用程序有两种情况,一种是软件的位数和电脑系统的位数不一致,另外一种是电脑的注册表有问题,需要清理. Right click on 'fasuitevs. Better, do all of the following:. i have never used tensorflow in Python but 99% of the time %1 is the key for a filepath input parameter. In the Open box, type regedit, and then click OK. 193 (0xC1) %1 is not a valid Win32 application. This is an error code that indicates either the file or the program you are attempting to run missing or corrupt. Error: ImportError: DLL load failed: %1 is not a valid Win32 application. In this video, I gonna show you how to fix the Dev-c++ error that Failed to execute. So I got H1Z1 yesterday thinking it would be amazing to make some videos on, but when I went to load it it gave me this error. running 64-bit process with the same name, but on a 32-bit OS) or. from __future__ import print_function import torch x = torch. eirslett:frontend-maven-plugin:1. RAM Structural System V8i 14. Fix: As a workaround, don't keep your project in your "My Documents" folder, move it to C:\projects instead. Support call is still open. dll somewhere in you system PATH, for example C:WINDOWSsystem32. 8-nts-Win32-vs16-x64. I'm hoping the situation will improve as Windows 10 matures, but I've seen permissions issues even on clean installs (usually inconsequential to the main operation of the PC, but still these were clean installs). The fix is slowly making its way through the various third-party projects that needed to be fixed, so soon the answer will be "python -m pip install --upgrade pip". dll from C:\ProgramData\Anaconda3\Lib\site-packages\; I uninstalled wordcloud and Numpy, then installed; pip uninstall wordcloud. exe:CreateProcess失败,错误193:%1不是有效的Win32应用程序. Amazingly true. 413 AMD E1-1500 APU with radeon(tm) HD graphics 1. Reported component ID. 7 is attached here. Greetings Stefan. CreateProcess. Contact us for help registering your account. This is the readme for the Python for Win32 (pywin32) extensions, which provides access to many of the Windows APIs from Python. exe requires elevation. dll c:\Windows\SysWOW64\msvcr100_clr0400. The official zlib website doesn't offer a working build of the latest version. xf-adesk20_v2. exe will always get the source files from CMG. prototype (func_spec[, paramflags]) Returns a foreign function exported by a shared library. There are also two shape selectors. OS: Windows 10, openSuse 42. これを修正するには、次のことができます. Jan 30, 2010 · To add quotation marks around the ImagePath value for a service: 1. My understanding from google research is that we can execute any python script using the local python engine using executestreamcommand processor provided. now im not sure why its happening because this should work for my system, i am running Windows 10 pro version 19042. exe with this. Cannot run %1 in Win32 mode. Usually launching the corresponding setups from the 3rdParty install folder on your DVD or extracted setup repair such issues. This issue does not exist in Acronis Backup 12. Replacing the dlls mentioned below from a machine that is working solves the problem: c:\Windows\SysWOW64\msvcp100. C:\Windows\system32\powershell. dll is 2,138 KB. Try to install it in XP SP2 compatible mode. Locate, and then click the following registry entry, where is the name of the service: HKEY_LOCAL_MACHINE\SYSTEM\CurrentControlSet\Services\. Pi-Star is a software image built initially for the Raspberry Pi (produced by the Raspberry Pi Foundation). org (see website for access through a browser). x86_64 is set built fails, if unset it succeeds). Locate, and then click the following registry entry, where is the name of the service: 4. 5 时) Technical Articles ID: KB73814 Last Modified: 2013/12/11 Environment. View solution in original post. In the developer. zip) MD5: 12322d7019816cc320b17988a4ed7c79 | Signature Windows (x86, 64-bit), ZIP Archive Debug Binaries & Test Suite: Apr 23, 2021: 490. have bad, stray, or whitespace characters) or. Posted 25 January 2010 - 02:42 PM. To report a bug in NetBeans please follow the project's instructions for reporting issues. View solution in original post. ERROR (1053) The service did not respond to the start or control request in a timely fashion. cpl is a windows system file. ERROR_INVALID_MINALLOCSIZE. Server time: Jul/02/2021 22:53:13 (h3). 126 (a5e4c2e567) Azure CLI version az --version azure-cli 2. 通过Java和Selenium启动Internet Explorer时出现" OsProcess checkForError:CreateProcess错误= 193,%1不是有效的Win32应用程序" Pycharm与Electron -Runnerw. I had a program developed in C# VS2010 and VS2005. Hi Guys, I'm in dire need of some help here. DoppelPaymer is believed to be based on the BitPaymer Ransomware (which first appeared in 2017) due to similarities in their code, ransom notes, and payment portals. PARAMETER ID. IOException: Cannot run program "E:\Program Files\arduino-1. WIN32_EXIT_CODE : 193 (0xc1) SERVICE_EXIT_CODE : 0 (0x0) CHECKPOINT : 0x0. Submitted: 9 Jun 2003 20:59. exe is not a valid win32 application" indicates that the EXE file did not download completely. Disk Get-Disk To list all operating system visible disks type: You'll get something like: Note: If you run Get-Disk without Admin rights you will receive the following error: "Access to a CIM resource was…. However, I cannot seem to write a successful batch command · The complication is that mmc. 4 and GEOS (via OSGeo4W ) Then I installed postGIS via Stack App Builder (I have tried both versions - x32 and x64). 413 AMD E1-1500 APU with radeon(tm) HD graphics 1. If you are interested in this topic, please fill a short survey. This worked for me, at least the flashing of the factory image was successful. You will always have the renamed files, in case you need to restore things to how they were before you made the. The extension that is embedded in the application is home. More specifically, I downloaded php5apache2_4. , not compensating for paths with. msc" inside the text box and press Ctrl + Shift + Enter to open up the Local Group Policy Editor with admin privileges. See full list on metacpan. zip 6/29/2021 4:38 PM 24080315 php-8. If the iso is created on a computer already running Windows 10, simply put a blank DVD in the optical drive, right-click the. io, or by using our public dataset on Google BigQuery. ERROR_BAD_EXE_FORMAT: 194: 0x000000C2: The operating system cannot run %1. DoppelPaymer is believed to be based on the BitPaymer Ransomware (which first appeared in 2017) due to similarities in their code, ransom notes, and payment portals. As a workaround, disable HVCI on the machine as described in this article. I have been asked by my mom to update and prepare her laptop for her to do the taxes. I tried it too and your right. 'C:\Temp\AppName. It's not detected as malware but as a potentially unwanted application which is optional detection. fat from this ZIP file to the (FC3 install location)\data_win32 folder, overwrite original files if prompted. ERROR_BAD_EXE_FORMAT: 194: 0x000000C2: The operating system cannot run %1. Removing PC viruses manually may take hours and may damage your PC in the process. The design concept is simple, provide the complex services and configuration for Digial Voice on Amateur radio in a way that makes it easily accessable to anyone just starting out, but make it configurable enough to be interesting for those of us who cant help but tinker. is not a valid Win32 application. 193 on November 9, 2020. On my setup (Windows Server 2012 R2) importing GDAL in Python in the terminal prints the following: >>> import gdal ERROR 1: Can't load requested DLL: C:\Program Files (x86)\GDAL\gdalplugins\gdal_ BAG. Click Start, and then click Run. 04 ProgeCAD 2016 Professional v16. StartService() failed. 前提・実現したいことファイルを実行したいです。初心者です。anaconda prompt から atomを立ち上げています。 発生している問題・エラーメッセージC:\\code\\fx>python pred. IOException: CreateProcess error=193, %1 is not a valid. hoddack_rasta Messages postés 5 Date d'inscription jeudi 7 mars 2019 Statut Membre Dernière intervention 27 mars 2019 - 27 mars 2019 à 11:27 ratenpion Messages postés 512 Date d'inscription mercredi 8 octobre 2003. SSAPI PATTERN Date: 18 Jul 2019. (And the same applies to any CPython extension. The operating system cannot run %1. put a check in the box by run this program in compatibility. Ask questions caffe2_detectron_ops_gpu. For optimal experience: Start a new game. WIN32_EXIT_CODE : 193 (0xc1) SERVICE_EXIT_CODE : 0 (0x0) CHECKPOINT : 0x0. As part of my job, a significant part of my working hours are all about troubleshooting SQL related issues. INTUNEWIN file. mingw-w64 threads: posix vs win32; Proper way to use **kwargs in Python; DJango doesn't execute request. Note that Win32 does not indicate you are running 32 bit code, it is just a label indicating you are using a Windows platform If it ain't broke, I just haven't gotten to it yet. dll 193: %1 is not a valid Win32 application. from ctypes import * lib = CDLL ( 'basicDLL' ) print (lib. In other words, you can make sure that a file download was successfully terminated ('0') and not aborted ('64. Joined Sep 8, 2005 Messages. Recently, I ran into exactly the same problem. ERROR_INVALID_EXE_SIGNATURE: 192: 0x000000C0: The operating system cannot run %1. Home » Eclipse Projects » Eclipse Platform » Building with -Dnative=win32. zip and used the PHP 5. Problem: I am a beginner to java, swing, netbeans and promise. When I open the program I receive 8 or so #193 not a valid win32 program errors for each of the. StartService() failed. It runs ok on Win10 computer. Change the rules of war. 63 (64-bit): The latest stable Chrome Portable includes a number of under-the-hood improvements. Then use the symlink in the registry ImagePath. 0x000000C3. Google Chrome 93. now im not sure why its happening because this should work for my system, i am running Windows 10 pro version 19042. Createprocess error=193, %1 is not a valid win32 application. Some searches pointed me to a 'fix' with the find_library part of the code, that I should replace it with the full path to the.